Reaction Details
TargetIodotyrosine deiodinase 1 [1-1,32-289]
LigandBDBM217397
Substrate/Competitorn/a
Meas. Tech.IYD Binding Assay
Kd 1.410e+6± 7.0e+4 nM
Citation Ingavat, NKavran, JMSun, ZRokita, SE Active Site Binding Is Not Sufficient for Reductive Deiodination by Iodotyrosine Deiodinase. Biochemistry56:1130-1139 (2017) 
 
Iodotyrosine deiodinase 1 [1-1,32-289]
Name:Iodotyrosine deiodinase 1 [1-1,32-289]
Type:Enzyme
Mol. Mass.:29825.93
Organism:Homo sapiens (Human)
Description:Human IYD without its N-terminal transmembrane sequence (2-31 aa)
Residue:259
BDBM217397
NameBDBM217397
Synonyms:2-Iodophenol (2IP)
TypeSmall organic molecule
Emp. Form.C6H5IO
Mol. Mass.220.0078
SMILESOc1ccccc1I