Reaction Details
TargetSodium channel protein type 9 subunit alpha
LigandBDBM217696
Substrate/Competitorn/a
Meas. Tech.Nav1.7 In Vitro PX Assay
IC50 23±n/a nM
Citation Weiss, MBoezio, ABoezio, CButler, JRChu-Moyer, MYDimauro, EFDineen, TGraceffa, RGuzman-Perez, AHuang, HKreiman, CLa, DMarx, IEMilgrim, BCNguyen, HNPeterson, ERomero, KSparling, B Bicyclic sulfonamide compounds as sodium channel inhibitors US Patent US9212182 Publication Date 12/15/2015
 
Sodium channel protein type 9 subunit alpha
Name:Sodium channel protein type 9 subunit alpha
Type:Protein
Mol. Mass.:226375.97
Organism:Homo sapiens (Human)
Description:Q15858
Residue:1988
BDBM217696
NameBDBM217696
Synonyms:US9212182, 672
TypeSmall organic molecule
Emp. Form.C27H19F3N4O4S
Mol. Mass.552.524
SMILESCOc1cc(ccc1-n1c2ccc(cc2ccc1=O)S(=O)(=O)Nc1ncccn1)-c1cccc(c1)C(F)(F)F