Reaction Details
TargetS-methyl-5'-thioinosine phosphorylase
LigandBDBM218674
Substrate/Competitorn/a
Meas. Tech.Inhibition Assay
pH7.4±n/a
Temperature298.15±n/a K
Ki 0.076±0.005 nM
Commentsextracted
Citation Schramm, VLClinch, KTyler, PCEvans, GBFurneaux, RH Methods, assays and compounds for treating bacterial infections by inhibiting methylthioinosine phosphorylase US Patent US9290501 Publication Date 3/22/2016
 
S-methyl-5'-thioinosine phosphorylase
Name:S-methyl-5'-thioinosine phosphorylase
Type:Enzyme
Mol. Mass.:26266.70
Organism:Pseudomonas aeruginosa
Description:Q9HZK1
Residue:245
BDBM218674
NameBDBM218674
Synonyms:US9290501, MT-ImmH
TypeSmall organic molecule
Emp. Form.C13H18N4O3S
Mol. Mass.310.372
SMILESCSC[C@H]1NC(Cc2c[nH]c3c2nc[nH]c3=O)C(O)C1O