Reaction Details
TargetApoptosis regulator Bcl-2
LigandBDBM60828
Substrate/Competitorn/a
Meas. Tech.DELFIA
IC50 4.4±0.1 nM
Citation Barile, EMarconi, GDDe, SKBaggio, CGambini, LSalem, AFKashyap, MKCastro, JEKipps, TJPellecchia, M hBfl-1/hNOXA Interaction Studies Provide New Insights on the Role of Bfl-1 in Cancer Cell Resistance and for the Design of Novel Anticancer Agents. ACS Chem Biol12:444-455 (2017) 
 
Apoptosis regulator Bcl-2
Name:Apoptosis regulator Bcl-2
Type:Homodimer or heterodimer
Mol. Mass.:26269.11
Organism:Homo sapiens (Human)
Description:P10415
Residue:239
BDBM60828
NameBDBM60828
Synonyms:ABT-199 US10213433, Compound 5 US11318134, Example ABT-199 US11590126, Example ABT-199 US20240043404, Example 369 | US9174982, 369
Typen/a
Emp. Form.C45H50ClN7O7S
Mol. Mass.868.439
SMILESCC1(C)CCC(CN2CCN(CC2)c2ccc(C(=O)NS(=O)(=O)c3ccc(NCC4CCOCC4)c(c3)[N+]([O-])=O)c(Oc3cnc4[nH]ccc4c3)c2)=C(C1)c1ccc(Cl)cc1