Reaction Details
TargetPaired box protein Pax-2 [1-81]
LigandBDBM218809
Substrate/Competitorn/a
Meas. Tech.Biolayer Interferometry Binding Assay
Kd 1.5e+3±n/a nM
Citation Grimley, ELiao, CRanghini, EJNikolovska-Coleska, ZDressler, GR Inhibition of Pax2 Transcription Activation with a Small Molecule that Targets the DNA Binding Domain. ACS Chem Biol12:724-734 (2017) 
 
Paired box protein Pax-2 [1-81]
Name:Paired box protein Pax-2 [1-81]
Type:Protein
Mol. Mass.:8841.67
Organism:Homo sapiens (Human)
Description:Human Pax2 (1-81 aa) containing the first DNA binding pocket defined in this study's homology model.
Residue:81
BDBM218809
NameBDBM218809
Synonyms:EG1
TypeSmall organic molecule
Emp. Form.C22H18N2O5
Mol. Mass.390.3887
SMILESCOc1ccccc1C(=O)Nc1ccc(cc1)C(=O)Nc1ccccc1C(O)=O