Reaction Details
TargetCasein kinase II subunit beta
LigandBDBM218917
Substrate/CompetitorBDBM220103
Meas. Tech.Inhibition Assay
pH7±n/a
IC50 649.2±n/a nM
Commentsextracted
Citation Haddach, MTran, JAPierre, FRegan, CFRaffaele, NRavula, SRyckman, DM Pyrazolopyrimidines and related heterocycles as CK2 inhibitors US Patent US9303033 Publication Date 4/5/2016
 
Casein kinase II subunit beta
Name:Casein kinase II subunit beta
Type:Enzyme
Mol. Mass.:24937.13
Organism:Homo sapiens (Human)
Description:P67870
Residue:215
BDBM218917
BDBM220103
NameBDBM218917
Synonyms:US9303033, J7, Table 22A, Compound 4 | US9303033, X3, Table 13A, Compound 6
TypeSmall organic molecule
Emp. Form.C20H18N6O4S
Mol. Mass.438.46
SMILESCS(=O)(=O)c1cccc(c1)-c1cc(NC2CC2)n2ncc(\C=C3/NC(=O)NC3=O)c2n1