Reaction Details
TargetCasein kinase II subunit beta
LigandBDBM218946
Substrate/CompetitorBDBM220103
Meas. Tech.Inhibition Assay
pH7±n/a
IC50 867±n/a nM
Commentsextracted
Citation Haddach, MTran, JAPierre, FRegan, CFRaffaele, NRavula, SRyckman, DM Pyrazolopyrimidines and related heterocycles as CK2 inhibitors US Patent US9303033 Publication Date 4/5/2016
 
Casein kinase II subunit beta
Name:Casein kinase II subunit beta
Type:Enzyme
Mol. Mass.:24937.13
Organism:Homo sapiens (Human)
Description:P67870
Residue:215
BDBM218946
BDBM220103
NameBDBM218946
Synonyms:US9303033, A5, Table 13A, Compound 35 | US9303033, X7, Table 22A, Compound 18
TypeSmall organic molecule
Emp. Form.C22H21N7O4S
Mol. Mass.479.512
SMILESO=C1NC(=O)\C(N1)=C\c1cnn2c(NC3CC3)cc(nc12)-c1cccc(NS(=O)(=O)C2CC2)c1