Reaction Details
TargetAldo-keto reductase family 1 member C3
LigandBDBM50396691
Substrate/Competitorn/a
Meas. Tech.Discontinuous Radiometric Assay
Ki 21000±n/a nM
Citation Penning, TMAdeniji, AOBurns, MCWinkler, JTwenter, B Bifunctional AKR1C3 inhibitors/androgen receptor modulators and methods of use thereof US Patent US9271961 Publication Date 3/1/2016
 
Aldo-keto reductase family 1 member C3
Name:Aldo-keto reductase family 1 member C3
Type:Enzyme
Mol. Mass.:36859.86
Organism:Homo sapiens (Human)
Description:P42330
Residue:323
BDBM50396691
NameBDBM50396691
Synonyms:CHEMBL449572 | US9271961, Jasmonic acid
TypeSmall organic molecule
Emp. Form.C12H18O3
Mol. Mass.210.2695
SMILESCC\C=C/C[C@@H]1[C@@H](CC(O)=O)CCC1=O