Reaction Details
TargetAldo-keto reductase family 1 member C2
LigandBDBM220121
Substrate/Competitorn/a
Meas. Tech.Discontinuous Radiometric Assay
Ki>10000±n/a nM
Citation Penning, TMAdeniji, AOBurns, MCWinkler, JTwenter, B Bifunctional AKR1C3 inhibitors/androgen receptor modulators and methods of use thereof US Patent US9271961 Publication Date 3/1/2016
 
Aldo-keto reductase family 1 member C2
Name:Aldo-keto reductase family 1 member C2
Type:Enzyme
Mol. Mass.:36739.89
Organism:Homo sapiens (Human)
Description:n/a
Residue:323
BDBM220121
NameBDBM220121
Synonyms:US9271961, Cloxazolam
TypeSmall organic molecule
Emp. Form.C17H14Cl2N2O2
Mol. Mass.349.211
SMILESClc1ccc2NC(=O)CN3CCOC3(c3ccccc3Cl)c2c1