Reaction Details
TargetAldo-keto reductase family 1 member C3
LigandBDBM220120
Substrate/Competitorn/a
Meas. Tech.Discontinuous Radiometric Assay
IC50 5000±n/a nM
Citation Penning, TMAdeniji, AOBurns, MCWinkler, JTwenter, B Bifunctional AKR1C3 inhibitors/androgen receptor modulators and methods of use thereof US Patent US9271961 Publication Date 3/1/2016
 
Aldo-keto reductase family 1 member C3
Name:Aldo-keto reductase family 1 member C3
Type:Enzyme
Mol. Mass.:36859.86
Organism:Homo sapiens (Human)
Description:P42330
Residue:323
BDBM220120
NameBDBM220120
Synonyms:US9271961, Bimatoprost
TypeSmall organic molecule
Emp. Form.C25H37NO4
Mol. Mass.415.5656
SMILESCCNC(=O)CCC\C=C/C[C@H]1[C@@H](O)C[C@@H](O)[C@@H]1\C=C\[C@@H](O)CCc1ccccc1