Reaction Details
TargetAldo-keto reductase family 1 member C3
LigandBDBM50337284
Substrate/Competitorn/a
Meas. Tech.Discontinuous Radiometric Assay
IC50 130±n/a nM
Citation Penning, TMAdeniji, AOBurns, MCWinkler, JTwenter, B Bifunctional AKR1C3 inhibitors/androgen receptor modulators and methods of use thereof US Patent US9271961 Publication Date 3/1/2016
 
Aldo-keto reductase family 1 member C3
Name:Aldo-keto reductase family 1 member C3
Type:Enzyme
Mol. Mass.:36859.86
Organism:Homo sapiens (Human)
Description:P42330
Residue:323
BDBM50337284
NameBDBM50337284
Synonyms:3-[N-(4-chlorophenyl)amino]benzoic acid US9271961, 8
TypeSmall organic molecule
Emp. Form.C13H10ClNO2
Mol. Mass.247.677
SMILESOC(=O)c1cccc(Nc2ccc(Cl)cc2)c1