Reaction Details
TargetAldo-keto reductase family 1 member C3
LigandBDBM50337285
Substrate/Competitorn/a
Meas. Tech.Discontinuous Radiometric Assay
IC50 120±n/a nM
Citation Penning, TMAdeniji, AOBurns, MCWinkler, JTwenter, B Bifunctional AKR1C3 inhibitors/androgen receptor modulators and methods of use thereof US Patent US9271961 Publication Date 3/1/2016
 
Aldo-keto reductase family 1 member C3
Name:Aldo-keto reductase family 1 member C3
Type:Enzyme
Mol. Mass.:36859.86
Organism:Homo sapiens (Human)
Description:P42330
Residue:323
BDBM50337285
NameBDBM50337285
Synonyms:3-[N-(4-bromophenyl)amino]benzoic acid US9271961, 9
TypeSmall organic molecule
Emp. Form.C13H10BrNO2
Mol. Mass.292.128
SMILESOC(=O)c1cccc(Nc2ccc(Br)cc2)c1