Reaction Details
TargetAldo-keto reductase family 1 member C3
LigandBDBM50337287
Substrate/Competitorn/a
Meas. Tech.Discontinuous Radiometric Assay
IC50 490±n/a nM
Citation Penning, TMAdeniji, AOBurns, MCWinkler, JTwenter, B Bifunctional AKR1C3 inhibitors/androgen receptor modulators and methods of use thereof US Patent US9271961 Publication Date 3/1/2016
 
Aldo-keto reductase family 1 member C3
Name:Aldo-keto reductase family 1 member C3
Type:Enzyme
Mol. Mass.:36859.86
Organism:Homo sapiens (Human)
Description:P42330
Residue:323
BDBM50337287
NameBDBM50337287
Synonyms:3-[N-(4-methoxyphenyl)amino]benzoic acid US9271961, 11
TypeSmall organic molecule
Emp. Form.C14H13NO3
Mol. Mass.243.2579
SMILESCOc1ccc(Nc2cccc(c2)C(O)=O)cc1