Reaction Details
TargetAldo-keto reductase family 1 member C3
LigandBDBM220123
Substrate/Competitorn/a
Meas. Tech.Discontinuous Radiometric Assay
IC50 30±n/a nM
Citation Penning, TMAdeniji, AOBurns, MCWinkler, JTwenter, B Bifunctional AKR1C3 inhibitors/androgen receptor modulators and methods of use thereof US Patent US9271961 Publication Date 3/1/2016
 
Aldo-keto reductase family 1 member C3
Name:Aldo-keto reductase family 1 member C3
Type:Enzyme
Mol. Mass.:36859.86
Organism:Homo sapiens (Human)
Description:P42330
Residue:323
BDBM220123
NameBDBM220123
Synonyms:US9271961, BMT 5-119
TypeSmall organic molecule
Emp. Form.C14H9F3N2O4
Mol. Mass.326.2275
SMILESOC(=O)c1ccccc1Nc1cc(ccc1N(=O)=O)C(F)(F)F