Reaction Details
TargetAldo-keto reductase family 1 member C3
LigandBDBM220124
Substrate/Competitorn/a
Meas. Tech.Discontinuous Radiometric Assay
IC50 40±n/a nM
Citation Penning, TMAdeniji, AOBurns, MCWinkler, JTwenter, B Bifunctional AKR1C3 inhibitors/androgen receptor modulators and methods of use thereof US Patent US9271961 Publication Date 3/1/2016
 
Aldo-keto reductase family 1 member C3
Name:Aldo-keto reductase family 1 member C3
Type:Enzyme
Mol. Mass.:36859.86
Organism:Homo sapiens (Human)
Description:P42330
Residue:323
BDBM220124
NameBDBM220124
Synonyms:US9271961, BMT 4-90
TypeSmall organic molecule
Emp. Form.C14H12N2O5
Mol. Mass.288.2555
SMILESCOc1ccc(c(Nc2ccccc2C(O)=O)c1)N(=O)=O