Reaction Details
TargetAldo-keto reductase family 1 member C3
LigandBDBM220115
Substrate/Competitorn/a
Meas. Tech.Discontinuous Radiometric Assay
IC50 80±n/a nM
Citation Penning, TMAdeniji, AOBurns, MCWinkler, JTwenter, B Bifunctional AKR1C3 inhibitors/androgen receptor modulators and methods of use thereof US Patent US9271961 Publication Date 3/1/2016
 
Aldo-keto reductase family 1 member C3
Name:Aldo-keto reductase family 1 member C3
Type:Enzyme
Mol. Mass.:36859.86
Organism:Homo sapiens (Human)
Description:P42330
Residue:323
BDBM220115
NameBDBM220115
Synonyms:US9271961, 13
TypeSmall organic molecule
Emp. Form.C18H14N2O4
Mol. Mass.322.3148
SMILESCOC(=O)c1cccc(Nc2ccc([N+]([O-])=O)c3ccccc23)c1