Reaction Details
TargetAldo-keto reductase family 1 member C2
LigandBDBM50337280
Substrate/Competitorn/a
Meas. Tech.Discontinuous Radiometric Assay
IC50 3000±n/a nM
Citation Penning, TMAdeniji, AOBurns, MCWinkler, JTwenter, B Bifunctional AKR1C3 inhibitors/androgen receptor modulators and methods of use thereof US Patent US9271961 Publication Date 3/1/2016
 
Aldo-keto reductase family 1 member C2
Name:Aldo-keto reductase family 1 member C2
Type:Enzyme
Mol. Mass.:36739.89
Organism:Homo sapiens (Human)
Description:n/a
Residue:323
BDBM50337280
NameBDBM50337280
Synonyms:4-phenylamino benzoic acid US9271961, 4
TypeSmall organic molecule
Emp. Form.C13H11NO2
Mol. Mass.213.2319
SMILESOC(=O)c1ccc(Nc2ccccc2)cc1