Reaction Details
TargetAldo-keto reductase family 1 member C1
LigandBDBM50337281
Substrate/Competitorn/a
Meas. Tech.Discontinuous Radiometric Assay
IC50 6740±n/a nM
Citation Penning, TMAdeniji, AOBurns, MCWinkler, JTwenter, B Bifunctional AKR1C3 inhibitors/androgen receptor modulators and methods of use thereof US Patent US9271961 Publication Date 3/1/2016
 
Aldo-keto reductase family 1 member C1
Name:Aldo-keto reductase family 1 member C1
Type:Enzyme
Mol. Mass.:36793.97
Organism:Homo sapiens (Human)
Description:Recombinant AKR1C1 enzyme was expressed in E. coli.
Residue:323
BDBM50337281
NameBDBM50337281
Synonyms:3-[N-(4-nitrophenyl)amino]benzoic acid US9271961, 5
TypeSmall organic molecule
Emp. Form.C13H10N2O4
Mol. Mass.258.2295
SMILESOC(=O)c1cccc(Nc2ccc(cc2)[N+]([O-])=O)c1