Reaction Details
TargetProstaglandin G/H synthase 2
LigandBDBM17636
Substrate/Competitorn/a
Meas. Tech.Discontinuous Radiometric Assay
IC50 16±n/a nM
Citation Penning, TMAdeniji, AOBurns, MCWinkler, JTwenter, B Bifunctional AKR1C3 inhibitors/androgen receptor modulators and methods of use thereof US Patent US9271961 Publication Date 3/1/2016
 
Prostaglandin G/H synthase 2
Name:Prostaglandin G/H synthase 2
Type:Enzyme
Mol. Mass.:69003.89
Organism:Homo sapiens (Human)
Description:Recombinant Cox-2 provided by Cayman (Cayman Chemical Co.,Ann Arbor, MI).
Residue:604
BDBM17636
NameBDBM17636
Synonyms:2-{[3-(trifluoromethyl)phenyl]amino}benzoic acid CHEMBL23588 Nichisedan US9271961, Flufenamic Acid
TypeSmall organic molecule
Emp. Form.C14H10F3NO2
Mol. Mass.281.2299
SMILESOC(=O)c1ccccc1Nc1cccc(c1)C(F)(F)F