Reaction Details
TargetAromatase
LigandBDBM8611
Substrate/CompetitorBDBM8592
Meas. Tech.CYP19 Inhibition Assay
pH7.4±n/a
IC50 29.5±n/a nM
Commentsextracted
Citation Hartmann, RVoets, MMüller-Vieira, U Selective inhibitors of human corticosteroid synthases US Patent US9271963 Publication Date 3/1/2016
 
Aromatase
Name:Aromatase
Type:Enzyme
Mol. Mass.:57888.92
Organism:Homo sapiens (Human)
Description:P11511
Residue:503
BDBM8611
BDBM8592
NameBDBM8611
Synonyms:4-{5H,6H,7H,8H-imidazo[1,5-a]pyridin-5-yl}benzonitrile CHEMBL9298 US9271963, Fadrozole
TypeSmall organic molecule
Emp. Form.C14H13N3
Mol. Mass.223.2731
SMILESN#Cc1ccc(cc1)C1CCCc2cncn12