Reaction Details
TargetIsoform Alpha-4-2 of Neuronal acetylcholine receptor subunit alpha-4 (Alpha-4-2)/Neuronal acetylcholine receptor subunit beta-2
LigandBDBM221036
Substrate/Competitorn/a
Meas. Tech.[3H]Epibatidine Binding Assay
pH7.4±n/a
Temperature298.15±n/a K
Ki 0.049±0.02 nM
Commentsextracted
Citation Carroll, FIOndachi, PW Nicotinic receptor compounds US Patent US9284322 Publication Date 3/15/2016
 
Isoform Alpha-4-2 of Neuronal acetylcholine receptor subunit alpha-4 (Alpha-4-2)/Neuronal acetylcholine receptor subunit beta-2
Name:Isoform Alpha-4-2 of Neuronal acetylcholine receptor subunit alpha-4 (Alpha-4-2)/Neuronal acetylcholine receptor subunit beta-2
Type:Enzyme
Mol. Mass.:n/a
Description:n/a
Components:This complex has 2 components.
Component 1
Name:Isoform Alpha-4-2 of Neuronal acetylcholine receptor subunit alpha-4 (Alpha-4-2)
Synonyms:ACHA4_RAT Chrna4 Neuronal acetylcholine receptor subunit alpha-4 (Alpha-4-2) | Neuronal acetylcholine receptor subunit alpha-4 beta 2
Type:Enzyme
Mol. Mass.:70323.63
Organism:Rattus norvegicus (Rat)
Description:P09483-2
Residue:631
Component 2
Name:Neuronal acetylcholine receptor subunit beta-2
Synonyms:ACHB2_RAT Chrnb2 Neuronal acetylcholine receptor non-alpha-1 chain
Type:Enzyme
Mol. Mass.:56910.32
Organism:Rattus norvegicus (Rat)
Description:P12390
Residue:500
BDBM221036
NameBDBM221036
Synonyms:US9284322, Table 6, Compound 2
TypeSmall organic molecule
Emp. Form.C16H15F2N3
Mol. Mass.287.3072
SMILESFc1ccc(cn1)-c1cc(cnc1F)C1CC2CCC1N2