Reaction Details
TargetNeuronal acetylcholine receptor subunit alpha-7
LigandBDBM221045
Substrate/Competitorn/a
Meas. Tech.[125I]Iodo-MLA Binding Assay
pH7.4±n/a
Ki 32.5±1.3 nM
Commentsextracted
Citation Carroll, FIOndachi, PW Nicotinic receptor compounds US Patent US9284322 Publication Date 3/15/2016
 
Neuronal acetylcholine receptor subunit alpha-7
Name:Neuronal acetylcholine receptor subunit alpha-7
Type:Enzyme
Mol. Mass.:56502.44
Organism:Rattus norvegicus (Rat)
Description:Q05941
Residue:502
BDBM221045
NameBDBM221045
Synonyms:US9284322, Table 7, Compound 1
TypeSmall organic molecule
Emp. Form.C15H16N4
Mol. Mass.252.3143
SMILESC1CC2NC1CC2c1cncc(c1)-c1cncnc1