Reaction Details
TargetDiacylglycerol O-acyltransferase 1
LigandBDBM220396
Substrate/Competitorn/a
Meas. Tech.PMSA Inhibition Assay
Ki 0.047±0.005 nM
IC50 1.05±0.11 nM
Citation Spiegel, DMurelli, RZhang, A Chimeric small molecules for the recruitment of antibodies to cancer cells US Patent US9296708 Publication Date 3/29/2016
 
Diacylglycerol O-acyltransferase 1
Name:Diacylglycerol O-acyltransferase 1
Type:Protein
Mol. Mass.:55297.82
Organism:Homo sapiens (Human)
Description:O75907
Residue:488
BDBM220396
NameBDBM220396
Synonyms:US9296708, 2, ARM-P1
TypeSmall organic molecule
Emp. Form.C23H30N8O12
Mol. Mass.610.5307
SMILESOC(=O)CC[C@H](NC(=O)N[C@@H](CCCCn1cc(COCCNc2ccc(cc2[N+]([O-])=O)[N+]([O-])=O)nn1)C(O)=O)C(O)=O