Reaction Details
TargetDiacylglycerol O-acyltransferase 1
LigandBDBM220397
Substrate/Competitorn/a
Meas. Tech.PMSA Inhibition Assay
Ki 0.024±0.008 nM
IC50 0.54±0.18 nM
Citation Spiegel, DMurelli, RZhang, A Chimeric small molecules for the recruitment of antibodies to cancer cells US Patent US9296708 Publication Date 3/29/2016
 
Diacylglycerol O-acyltransferase 1
Name:Diacylglycerol O-acyltransferase 1
Type:Protein
Mol. Mass.:55297.82
Organism:Homo sapiens (Human)
Description:O75907
Residue:488
BDBM220397
NameBDBM220397
Synonyms:US9296708, 3, ARM-P2
TypeSmall organic molecule
Emp. Form.C25H34N8O13
Mol. Mass.654.5833
SMILESOC(=O)CC[C@H](NC(=O)N[C@@H](CCCCn1cc(COCCOCCNc2ccc(cc2[N+]([O-])=O)[N+]([O-])=O)nn1)C(O)=O)C(O)=O