Reaction Details
TargetDiacylglycerol O-acyltransferase 1
LigandBDBM220403
Substrate/Competitorn/a
Meas. Tech.PMSA Inhibition Assay
Ki 1.81±0.42 nM
IC50 40.8±9.4 nM
Citation Spiegel, DMurelli, RZhang, A Chimeric small molecules for the recruitment of antibodies to cancer cells US Patent US9296708 Publication Date 3/29/2016
 
Diacylglycerol O-acyltransferase 1
Name:Diacylglycerol O-acyltransferase 1
Type:Protein
Mol. Mass.:55297.82
Organism:Homo sapiens (Human)
Description:O75907
Residue:488
BDBM220403
NameBDBM220403
Synonyms:US9296708, 9, MeO-P2
TypeSmall organic molecule
Emp. Form.C20H33N5O10
Mol. Mass.503.5035
SMILESCOCCOCCOCc1cn(CCCC[C@H](NC(=O)N[C@@H](CCC(O)=O)C(O)=O)C(O)=O)nn1