Reaction Details
TargetCannabinoid receptor 2
LigandBDBM221157
Substrate/Competitorn/a
Meas. Tech.cAMP Assay
Temperature310.15±n/a K
EC50 759.5±n/a nM
Commentsextracted
Citation Bendels, SGrether, UKimbara, ANettekoven, MRoever, SRogers-Evans, MSchaffter, ESchulz-Gasch, T Pyridine-2-amides useful as CB2 agonists US Patent US9303012 Publication Date 4/5/2016
 
Cannabinoid receptor 2
Name:Cannabinoid receptor 2
Type:G Protein-Coupled Receptor (GPCR)
Mol. Mass.:39690.94
Organism:Homo sapiens (Human)
Description:P34972
Residue:360
BDBM221157
NameBDBM221157
Synonyms:US9303012, 83
TypeSmall organic molecule
Emp. Form.C19H23F2N3O4
Mol. Mass.395.4004
SMILESOC1COC2(CN(C2)C(=O)c2ccc(N3CC(F)(F)C3)c(OCC3CC3)n2)C1