Reaction Details
TargetCannabinoid receptor 1
LigandBDBM221132
Substrate/Competitorn/a
Meas. Tech.cAMP Assay
Temperature310.15±n/a K
EC50>10000±n/a nM
Commentsextracted
Citation Bendels, SGrether, UKimbara, ANettekoven, MRoever, SRogers-Evans, MSchaffter, ESchulz-Gasch, T Pyridine-2-amides useful as CB2 agonists US Patent US9303012 Publication Date 4/5/2016
 
Cannabinoid receptor 1
Name:Cannabinoid receptor 1
Type:G Protein-Coupled Receptor (GPCR)
Mol. Mass.:52868.96
Organism:Homo sapiens (Human)
Description:P21554
Residue:472
BDBM221132
NameBDBM221132
Synonyms:US9303012, 58
TypeSmall organic molecule
Emp. Form.C24H32F2N4O3
Mol. Mass.462.5327
SMILESCC1(C)CC(C2CCN(CC2)C(=O)c2ccc(N3CC(F)(F)C3)c(OCC3CC3)n2)C(=O)N1