Reaction Details
TargetCannabinoid receptor 1
LigandBDBM221136
Substrate/Competitorn/a
Meas. Tech.cAMP Assay
Temperature310.15±n/a K
EC50>10000±n/a nM
Commentsextracted
Citation Bendels, SGrether, UKimbara, ANettekoven, MRoever, SRogers-Evans, MSchaffter, ESchulz-Gasch, T Pyridine-2-amides useful as CB2 agonists US Patent US9303012 Publication Date 4/5/2016
 
Cannabinoid receptor 1
Name:Cannabinoid receptor 1
Type:G Protein-Coupled Receptor (GPCR)
Mol. Mass.:52868.96
Organism:Homo sapiens (Human)
Description:P21554
Residue:472
BDBM221136
NameBDBM221136
Synonyms:US9303012, 62
TypeSmall organic molecule
Emp. Form.C18H21F2N3O2S
Mol. Mass.381.44
SMILESFC1(F)CN(C1)c1ccc(nc1OCC1CC1)C(=O)N1C[C@@H]2C[C@H]1CS2