Reaction Details
TargetCannabinoid receptor 1
LigandBDBM221142
Substrate/Competitorn/a
Meas. Tech.cAMP Assay
Temperature310.15±n/a K
EC50>10000±n/a nM
Commentsextracted
Citation Bendels, SGrether, UKimbara, ANettekoven, MRoever, SRogers-Evans, MSchaffter, ESchulz-Gasch, T Pyridine-2-amides useful as CB2 agonists US Patent US9303012 Publication Date 4/5/2016
 
Cannabinoid receptor 1
Name:Cannabinoid receptor 1
Type:G Protein-Coupled Receptor (GPCR)
Mol. Mass.:52868.96
Organism:Homo sapiens (Human)
Description:P21554
Residue:472
BDBM221142
NameBDBM221142
Synonyms:US9303012, 68
TypeSmall organic molecule
Emp. Form.C18H21F2N3O3
Mol. Mass.365.3744
SMILESNC(=O)[C@@H]1CC(F)(F)CN1C(=O)c1ccc(C2CC2)c(OCC2CC2)n1