Reaction Details
TargetCannabinoid receptor 1
LigandBDBM221148
Substrate/Competitorn/a
Meas. Tech.cAMP Assay
Temperature310.15±n/a K
EC50>10000±n/a nM
Commentsextracted
Citation Bendels, SGrether, UKimbara, ANettekoven, MRoever, SRogers-Evans, MSchaffter, ESchulz-Gasch, T Pyridine-2-amides useful as CB2 agonists US Patent US9303012 Publication Date 4/5/2016
 
Cannabinoid receptor 1
Name:Cannabinoid receptor 1
Type:G Protein-Coupled Receptor (GPCR)
Mol. Mass.:52868.96
Organism:Homo sapiens (Human)
Description:P21554
Residue:472
BDBM221148
NameBDBM221148
Synonyms:US9303012, 74
TypeSmall organic molecule
Emp. Form.C26H36F2N4O4
Mol. Mass.506.5852
SMILESCC(C)(C)OC(=O)N1CCC2(CCCN2C(=O)c2ccc(N3CC(F)(F)C3)c(OCC3CC3)n2)CC1