Reaction Details
TargetCannabinoid receptor 1
LigandBDBM221149
Substrate/Competitorn/a
Meas. Tech.cAMP Assay
Temperature310.15±n/a K
EC50>10000±n/a nM
Commentsextracted
Citation Bendels, SGrether, UKimbara, ANettekoven, MRoever, SRogers-Evans, MSchaffter, ESchulz-Gasch, T Pyridine-2-amides useful as CB2 agonists US Patent US9303012 Publication Date 4/5/2016
 
Cannabinoid receptor 1
Name:Cannabinoid receptor 1
Type:G Protein-Coupled Receptor (GPCR)
Mol. Mass.:52868.96
Organism:Homo sapiens (Human)
Description:P21554
Residue:472
BDBM221149
NameBDBM221149
Synonyms:US9303012, 75
TypeSmall organic molecule
Emp. Form.C19H23F2N3O4
Mol. Mass.395.4004
SMILESNC(=O)[C@@H]1CC(F)(F)CN1C(=O)c1ccc(C2CC2)c(OCC2CCCO2)n1