Reaction Details
TargetCannabinoid receptor 1
LigandBDBM221155
Substrate/Competitorn/a
Meas. Tech.cAMP Assay
Temperature310.15±n/a K
EC50>10000±n/a nM
Commentsextracted
Citation Bendels, SGrether, UKimbara, ANettekoven, MRoever, SRogers-Evans, MSchaffter, ESchulz-Gasch, T Pyridine-2-amides useful as CB2 agonists US Patent US9303012 Publication Date 4/5/2016
 
Cannabinoid receptor 1
Name:Cannabinoid receptor 1
Type:G Protein-Coupled Receptor (GPCR)
Mol. Mass.:52868.96
Organism:Homo sapiens (Human)
Description:P21554
Residue:472
BDBM221155
NameBDBM221155
Synonyms:US9303012, 81
TypeSmall organic molecule
Emp. Form.C20H23F2N5O3
Mol. Mass.419.4251
SMILESCc1nnc(CN(C2CC2)C(=O)c2ccc(N3CC(F)(F)C3)c(OCC3CC3)n2)o1