Reaction Details
TargetCannabinoid receptor 1
LigandBDBM221158
Substrate/Competitorn/a
Meas. Tech.cAMP Assay
Temperature310.15±n/a K
EC50>10000±n/a nM
Commentsextracted
Citation Bendels, SGrether, UKimbara, ANettekoven, MRoever, SRogers-Evans, MSchaffter, ESchulz-Gasch, T Pyridine-2-amides useful as CB2 agonists US Patent US9303012 Publication Date 4/5/2016
 
Cannabinoid receptor 1
Name:Cannabinoid receptor 1
Type:G Protein-Coupled Receptor (GPCR)
Mol. Mass.:52868.96
Organism:Homo sapiens (Human)
Description:P21554
Residue:472
BDBM221158
NameBDBM221158
Synonyms:US9303012, 84
TypeSmall organic molecule
Emp. Form.C18H21F5N2O2
Mol. Mass.392.3636
SMILESCC1(C)CCCN1C(=O)c1ccc(C2CC2)c(OCC(F)(F)C(F)(F)F)n1