Reaction Details
TargetNeuronal acetylcholine receptor subunit alpha-2/beta-2
LigandBDBM221048
Substrate/Competitorn/a
Meas. Tech.[3H]-Epibatidine Radioligand Binding Assay
pH7.4±n/a
Temperature277.15±n/a K
Ki 0.48±n/a nM
Commentsextracted
Citation Xiao, YKellar, KJBrown, MLPaige, MALiu, YLevin, EDRezvani, AH 2,5-disubstituted-pyridyl nicotinic ligands, and methods of use thereof US Patent US9303017 Publication Date 4/5/2016
 
Neuronal acetylcholine receptor subunit alpha-2/beta-2
Name:Neuronal acetylcholine receptor subunit alpha-2/beta-2
Type:n/a
Mol. Mass.:n/a
Description:ASSAY_ID of EBI is 143226
Components:This complex has 2 components.
Component 1
Name:Neuronal acetylcholine receptor subunit alpha-2
Synonyms:ACHA2_RAT Cholinergic, Nicotinic Alpha2Beta2 Chrna2
Type:Enzyme
Mol. Mass.:58597.25
Organism:Rattus norvegicus (Rat)
Description:P12389
Residue:511
Component 2
Name:Neuronal acetylcholine receptor subunit beta-2
Synonyms:ACHB2_RAT Chrnb2 Neuronal acetylcholine receptor non-alpha-1 chain
Type:Enzyme
Mol. Mass.:56910.32
Organism:Rattus norvegicus (Rat)
Description:P12390
Residue:500
BDBM221048
NameBDBM221048
Synonyms:US9284322, varenicline | US9303017, Varenicline
TypeSmall organic molecule
Emp. Form.C13H13N3
Mol. Mass.211.2624
SMILESC1[C@H]2CNC[C@@H]1c1cc3nccnc3cc21