Reaction Details
TargetNeuronal acetylcholine receptor subunit alpha-7
LigandBDBM82070
Substrate/Competitorn/a
Meas. Tech.[3H]-Epibatidine Radioligand Binding Assay
pH7.4±n/a
Temperature277.15±n/a K
Ki 517±n/a nM
Commentsextracted
Citation Xiao, YKellar, KJBrown, MLPaige, MALiu, YLevin, EDRezvani, AH 2,5-disubstituted-pyridyl nicotinic ligands, and methods of use thereof US Patent US9303017 Publication Date 4/5/2016
 
Neuronal acetylcholine receptor subunit alpha-7
Name:Neuronal acetylcholine receptor subunit alpha-7
Type:Enzyme
Mol. Mass.:56502.44
Organism:Rattus norvegicus (Rat)
Description:Q05941
Residue:502
BDBM82070
NameBDBM82070
Synonyms:CAS_29790-52-1 Nicotine-D salicylate US9303017, Nicotine
Typen/a
Emp. Form.C10H14N2
Mol. Mass.162.2316
SMILESCN1CCC[C@H]1c1cccnc1