Reaction Details
TargetMetabotropic glutamate receptor 2
LigandBDBM50017259
Substrate/Competitorn/a
Meas. Tech.mGlu Receptor In Vitro Assays
pH7.3±n/a
Temperature298.15±n/a K
EC50 155±29 nM
Commentsextracted
Citation Dhanya, RPSheffler, DJCosford, NDDahl, R Metabotropic glutamate receptor positive allosteric modulators (PAMS) and uses thereof US Patent US10099993 Publication Date 10/16/2018
 
Metabotropic glutamate receptor 2
Name:Metabotropic glutamate receptor 2
Type:Enzyme
Mol. Mass.:95584.88
Organism:Homo sapiens (Human)
Description:Q14416
Residue:872
BDBM50017259
NameBDBM50017259
Synonyms:CHEMBL3287701 | US10099993, Compound 50
TypeSmall organic molecule
Emp. Form.C24H30O7
Mol. Mass.430.4908
SMILESCOc1ccc(cc1OCCCCOc1ccc(C(=O)CC(C)C)c(O)c1C)C(O)=O