Reaction Details
TargetMetabotropic glutamate receptor 2
LigandBDBM50017261
Substrate/Competitorn/a
Meas. Tech.mGlu Receptor In Vitro Assays
pH7.3±n/a
Temperature298.15±n/a K
EC50 162±55 nM
Commentsextracted
Citation Dhanya, RPSheffler, DJCosford, NDDahl, R Metabotropic glutamate receptor positive allosteric modulators (PAMS) and uses thereof US Patent US10099993 Publication Date 10/16/2018
 
Metabotropic glutamate receptor 2
Name:Metabotropic glutamate receptor 2
Type:Enzyme
Mol. Mass.:95584.88
Organism:Homo sapiens (Human)
Description:Q14416
Residue:872
BDBM50017261
NameBDBM50017261
Synonyms:CHEMBL3287709 | US10099993, Compound 58
TypeSmall organic molecule
Emp. Form.C22H26O7
Mol. Mass.402.4376
SMILESCCC(=O)c1ccc(OCCCCOc2cc(ccc2OC)C(O)=O)c(C)c1O