Reaction Details
TargetMetabotropic glutamate receptor 3
LigandBDBM50017261
Substrate/Competitorn/a
EC50 6359±3655 nM
Citation Dhanya, RPSheffler, DJCosford, NDDahl, R Metabotropic glutamate receptor positive allosteric modulators (PAMS) and uses thereof US Patent US10099993 Publication Date 10/16/2018
 
Metabotropic glutamate receptor 3
Name:Metabotropic glutamate receptor 3
Type:Enzyme Catalytic Domain
Mol. Mass.:98889.09
Organism:Homo sapiens (Human)
Description:metabotropic glutamate 1c 0 HUMAN::Q14832
Residue:879
BDBM50017261
NameBDBM50017261
Synonyms:CHEMBL3287709 | US10099993, Compound 58
TypeSmall organic molecule
Emp. Form.C22H26O7
Mol. Mass.402.4376
SMILESCCC(=O)c1ccc(OCCCCOc2cc(ccc2OC)C(O)=O)c(C)c1O