Reaction Details
TargetCarbonic anhydrase 1
LigandBDBM222048
Substrate/Competitorn/a
Meas. Tech.Esterase Activity Assay
pH7.4±n/a
Temperature298.15±n/a K
Ki 0.6050±0.1653 nM
IC50 0.5974±0.0 nM
Commentsextracted
Citation Kocyigit, UMBudak, YGürdere, MBTekin, Å¿Köprülü, TKErtürk, FÖzcan, KGülçin, Ä°Ceylan, M Synthesis, characterization, anticancer, antimicrobial and carbonic anhydrase inhibition profiles of novel (3aR,4S,7R,7aS)-2-(4-((E)-3-(3-aryl)acryloyl) phenyl)-3a,4,7,7a-tetrahydro-1H-4,7-methanoisoindole-1,3(2H)-dione derivatives. Bioorg Chem70:118-125 (2017) 
 
Carbonic anhydrase 1
Name:Carbonic anhydrase 1
Type:Enzyme
Mol. Mass.:28873.37
Organism:Homo sapiens (Human)
Description:P00915
Residue:261
BDBM222048
NameBDBM222048
Synonyms:(3aR,4S,7R,7aS)-2-(4-((E)-3-(p-tolyl)acryloyl)phenyl)-3a,4,7,7atetrahydro-1H-4,7-methanoisoindole-1,3(2H)-dione (7c)
TypeSmall organic molecule
Emp. Form.C25H21NO3
Mol. Mass.383.4391
SMILESCc1ccc(\C=C\C(=O)c2ccc(cc2)N2C(=O)[C@H]3[C@@H]4C[C@@H](C=C4)[C@H]3C2=O)cc1