Reaction Details
TargetCarbonic anhydrase 1
LigandBDBM222057
Substrate/Competitorn/a
Meas. Tech.Esterase Activity Assay
pH7.4±n/a
Temperature298.15±n/a K
Ki 0.5952±0.1365 nM
IC50 0.6550±0.0 nM
Commentsextracted
Citation Kocyigit, UMBudak, YGürdere, MBTekin, Å¿Köprülü, TKErtürk, FÖzcan, KGülçin, Ä°Ceylan, M Synthesis, characterization, anticancer, antimicrobial and carbonic anhydrase inhibition profiles of novel (3aR,4S,7R,7aS)-2-(4-((E)-3-(3-aryl)acryloyl) phenyl)-3a,4,7,7a-tetrahydro-1H-4,7-methanoisoindole-1,3(2H)-dione derivatives. Bioorg Chem70:118-125 (2017) 
 
Carbonic anhydrase 1
Name:Carbonic anhydrase 1
Type:Enzyme
Mol. Mass.:28873.37
Organism:Homo sapiens (Human)
Description:P00915
Residue:261
BDBM222057
NameBDBM222057
Synonyms:(3aR,4S,7R,7aS)-2-(4-((E)-3-(furan-2-yl)acryloyl)phenyl)-3a,4,7,7a-tetrahydro-1H-4,7-methanoisoindole-1,3(2H)-dione (7l)
TypeSmall organic molecule
Emp. Form.C22H17NO4
Mol. Mass.359.3747
SMILESO=C(\C=C\c1ccco1)c1ccc(cc1)N1C(=O)[C@H]2[C@@H]3C[C@@H](C=C3)[C@H]2C1=O