Reaction Details
TargetCarbonic anhydrase 2
LigandBDBM222059
Substrate/Competitorn/a
Meas. Tech.Esterase Activity Assay
pH7.4±n/a
Temperature298.15±n/a K
Ki 0.4896±0.0909 nM
IC50 0.5509±0.0 nM
Commentsextracted
Citation Kocyigit, UMBudak, YGürdere, MBTekin, Å¿Köprülü, TKErtürk, FÖzcan, KGülçin, Ä°Ceylan, M Synthesis, characterization, anticancer, antimicrobial and carbonic anhydrase inhibition profiles of novel (3aR,4S,7R,7aS)-2-(4-((E)-3-(3-aryl)acryloyl) phenyl)-3a,4,7,7a-tetrahydro-1H-4,7-methanoisoindole-1,3(2H)-dione derivatives. Bioorg Chem70:118-125 (2017) 
 
Carbonic anhydrase 2
Name:Carbonic anhydrase 2
Type:Enzyme
Mol. Mass.:29250.71
Organism:Homo sapiens (Human)
Description:P00918
Residue:260
BDBM222059
NameBDBM222059
Synonyms:(3aR,4S,7R,7aS)-2-(4-((E)-3-(pyridin-4-yl)acryloyl)phenyl)-3a,4,7,7a-tetrahydro-1H-4,7-methanoisoindole-1,3(2H)-dione (7n)
TypeSmall organic molecule
Emp. Form.C23H18N2O3
Mol. Mass.370.4006
SMILESO=C(\C=C\c1ccncc1)c1ccc(cc1)N1C(=O)[C@H]2[C@@H]3C[C@@H](C=C3)[C@H]2C1=O