Reaction Details
TargetProstaglandin G/H synthase 2
LigandBDBM22319
Substrate/Competitorn/a
Meas. Tech.In Vitro COX Inhibition Assay
Kd 8.07e+3±n/a nM
Citation Singh, JSaini, VKumar, ABansal, R Synthesis, molecular docking and biological evaluation of some newer 2-substituted-4-(benzo[d][1,3]dioxol-5-yl)-6-phenylpyridazin-3(2H)-ones as potential anti-inflammatory and analgesic agents. Bioorg Chem71:201-210 (2017) 
 
Prostaglandin G/H synthase 2
Name:Prostaglandin G/H synthase 2
Type:Enzyme
Mol. Mass.:69003.89
Organism:Homo sapiens (Human)
Description:Recombinant Cox-2 provided by Cayman (Cayman Chemical Co.,Ann Arbor, MI).
Residue:604
BDBM22319
NameBDBM22319
Synonyms:(5Z,8Z,11Z,14Z)-icosa-5,8,11,14-tetraenoic acid Arachidonic acid (AA) [1-14C]Arachidonic acid
TypeUnsaturated fatty acid
Emp. Form.C20H32O2
Mol. Mass.304.4669
SMILESCCCCC\C=C/C\C=C/C\C=C/C\C=C/CCCC(O)=O