Reaction Details
TargetIsoform 2 of MAP kinase-interacting serine/threonine-protein kinase 1 (MNK1a) 344D]
LigandBDBM223042
Substrate/Competitorn/a
Meas. Tech.MKNK1 Kinase Assay
pH7.5±n/a
Temperature295.15±n/a K
IC50 9±n/a nM
Commentsextracted
Citation Eis, KPuehler, FZorn, LScholz, ALienau, PGnoth, MJBömer, UGünther, J Substituted imidazopyridazines US Patent US9320737 Publication Date 4/26/2016
 
Isoform 2 of MAP kinase-interacting serine/threonine-protein kinase 1 (MNK1a) 344D]
Name:Isoform 2 of MAP kinase-interacting serine/threonine-protein kinase 1 (MNK1a) 344D]
Type:Protein
Mol. Mass.:47416.00
Organism:Homo sapiens (Human)
Description:Q9BUB5-2 with T344D
Residue:424
BDBM223042
NameBDBM223042
Synonyms:US9320737, IV.1
TypeSmall organic molecule
Emp. Form.C21H19F3N4O5S
Mol. Mass.496.46
SMILESCOc1cccc2oc(cc12)-c1cnc2ccc(OCCCS(C)(=O)=NC(=O)C(F)(F)F)nn12