Reaction Details
TargetAlpha-glucosidase MAL32
LigandBDBM223115
Substrate/Competitorn/a
Meas. Tech.In Vitro α-Glucosidase Inhibitory Assay
pH6.8±n/a
IC50 7370±80 nM
Commentsextracted
Citation Wang, GWang, JHe, DLi, XLi, JPeng, Z Synthesis, in vitro evaluation and molecular docking studies of novel coumarin-isatin derivatives as a-glucosidase inhibitors. Chem Biol Drug Des89:456-463 (2017) 
 
Alpha-glucosidase MAL32
Name:Alpha-glucosidase MAL32
Type:Hydrolase
Mol. Mass.:68132.36
Organism:Saccharomyces cerevisiae
Description:Purchased from Wako Fine Chemicals Co. Ltd.
Residue:584
BDBM223115
NameBDBM223115
Synonyms:(Z)-N'-(1-(2-fluorobenzyl)-2-oxoindolin-3-ylidene)-2-((2-oxo-2H-chromen-7-yl)oxy)acetohydrazide (5j)
TypeSmall organic molecule
Emp. Form.C26H18FN3O5
Mol. Mass.471.4366
SMILESFc1ccccc1CN1C(=O)\C(=N/NC(=O)COc2ccc3ccc(=O)oc3c2)c2ccccc12