Reaction Details
TargetAlpha-glucosidase MAL32
LigandBDBM223122
Substrate/Competitorn/a
Meas. Tech.In Vitro α-Glucosidase Inhibitory Assay
pH6.8±n/a
IC50 2880±50 nM
Commentsextracted
Citation Wang, GWang, JHe, DLi, XLi, JPeng, Z Synthesis, in vitro evaluation and molecular docking studies of novel coumarin-isatin derivatives as a-glucosidase inhibitors. Chem Biol Drug Des89:456-463 (2017) 
 
Alpha-glucosidase MAL32
Name:Alpha-glucosidase MAL32
Type:Hydrolase
Mol. Mass.:68132.36
Organism:Saccharomyces cerevisiae
Description:Purchased from Wako Fine Chemicals Co. Ltd.
Residue:584
BDBM223122
NameBDBM223122
Synonyms:(Z)-N'-(5-chloro-1-(3-fluorobenzyl)-2-oxoindolin-3-ylidene)-2-((2-oxo-2H-chromen-7-yl)oxy)acetohydrazide (5q)
TypeSmall organic molecule
Emp. Form.C26H17ClFN3O5
Mol. Mass.505.882
SMILESFc1cccc(CN2C(=O)\C(=N/NC(=O)COc3ccc4ccc(=O)oc4c3)c3cc(Cl)ccc23)c1