Reaction Details
TargetAlpha-glucosidase MAL32
LigandBDBM223124
Substrate/Competitorn/a
Meas. Tech.In Vitro α-Glucosidase Inhibitory Assay
pH6.8±n/a
IC50 2850±60 nM
Commentsextracted
Citation Wang, GWang, JHe, DLi, XLi, JPeng, Z Synthesis, in vitro evaluation and molecular docking studies of novel coumarin-isatin derivatives as a-glucosidase inhibitors. Chem Biol Drug Des89:456-463 (2017) 
 
Alpha-glucosidase MAL32
Name:Alpha-glucosidase MAL32
Type:Hydrolase
Mol. Mass.:68132.36
Organism:Saccharomyces cerevisiae
Description:Purchased from Wako Fine Chemicals Co. Ltd.
Residue:584
BDBM223124
NameBDBM223124
Synonyms:(Z)-N'-(5-bromo-1-(2-chlorobenzyl)-2-oxoindolin-3-ylidene)-2-((2-oxo-2H-chromen-7-yl)oxy)acetohydrazide (5s)
TypeSmall organic molecule
Emp. Form.C26H17BrClN3O5
Mol. Mass.566.787
SMILESClc1ccccc1CN1C(=O)\C(=N/NC(=O)COc2ccc3ccc(=O)oc3c2)c2cc(Br)ccc12