Reaction Details
TargetMicrotubule-associated protein tau
LigandBDBM223575
Substrate/Competitorn/a
Meas. Tech.Inhibition Assay
pH7.6±n/a
IC50 600±n/a nM
Commentsextracted
Citation Sugimoto, HOkuda, MNakayama, SInoue, YSakata, YFujita, YTokizane, R Pyrazole derivative US Patent US9321752 Publication Date 4/26/2016
 
Microtubule-associated protein tau
Name:Microtubule-associated protein tau
Type:Protein
Mol. Mass.:78928.63
Organism:Homo sapiens (Human)
Description:P10636
Residue:758
BDBM223575
NameBDBM223575
Synonyms:US9321752, 16-2
TypeSmall organic molecule
Emp. Form.C28H23FN4O
Mol. Mass.450.5068
SMILESCn1ccc2ccc(\C=C\c3cc(\C=C\c4ccc(OCc5ccccn5)cc4F)n[nH]3)cc12