Reaction Details
TargetMicrotubule-associated protein tau
LigandBDBM223578
Substrate/Competitorn/a
Meas. Tech.Inhibition Assay
pH7.6±n/a
IC50 550±n/a nM
Commentsextracted
Citation Sugimoto, HOkuda, MNakayama, SInoue, YSakata, YFujita, YTokizane, R Pyrazole derivative US Patent US9321752 Publication Date 4/26/2016
 
Microtubule-associated protein tau
Name:Microtubule-associated protein tau
Type:Protein
Mol. Mass.:78928.63
Organism:Homo sapiens (Human)
Description:P10636
Residue:758
BDBM223578
NameBDBM223578
Synonyms:US9321752, 20-3
TypeSmall organic molecule
Emp. Form.C24H22N4O
Mol. Mass.382.4577
SMILESCn1cccc1\C=C\c1cc(\C=C\c2ccc(OCc3ccccn3)cc2)n[nH]1