Reaction Details
TargetMicrotubule-associated protein tau
LigandBDBM223582
Substrate/Competitorn/a
Meas. Tech.Inhibition Assay
pH7.6±n/a
IC50 640±n/a nM
Commentsextracted
Citation Sugimoto, HOkuda, MNakayama, SInoue, YSakata, YFujita, YTokizane, R Pyrazole derivative US Patent US9321752 Publication Date 4/26/2016
 
Microtubule-associated protein tau
Name:Microtubule-associated protein tau
Type:Protein
Mol. Mass.:78928.63
Organism:Homo sapiens (Human)
Description:P10636
Residue:758
BDBM223582
NameBDBM223582
Synonyms:US9321752, 32-5
TypeSmall organic molecule
Emp. Form.C25H24N4O
Mol. Mass.396.4843
SMILESCc1cc(OCc2ccccn2)ccc1\C=C\c1cc(\C=C\c2cccn2C)[nH]n1