Reaction Details
TargetSerine/threonine-protein kinase pim-1
LigandBDBM225042
Substrate/Competitorn/a
Meas. Tech.Enzyme Assay
IC50 1.009±n/a nM
Citation Wang, HCee, VJHerberich, BJJackson, CLLanman, BANixey, TPettus, LHReed, ABWu, BWurz, RTasker, A Azole compounds as PIM inhibitors US Patent US9321756 Publication Date 4/26/2016
 
Serine/threonine-protein kinase pim-1
Name:Serine/threonine-protein kinase pim-1
Type:Protein
Mol. Mass.:35681.82
Organism:Homo sapiens (Human)
Description:P11309
Residue:313
BDBM225042
NameBDBM225042
Synonyms:US9321756, 4
TypeSmall organic molecule
Emp. Form.C19H19N7O
Mol. Mass.361.4005
SMILESNc1nnc(o1)-c1ccc2[nH]cc(-c3cncc(NC4CCCC4)n3)c2c1